�s���{���R�[�h���͎s�撬���R�[�h,NO,�s���{����,�s�撬����,����,����_�J�i,����_�ʏ�,����_�p��,����������,���,�ꏊ����,�Z��,����,�ܓx,�o�x,�d�b�ԍ�,�����ԍ�,�����i���j,�����i�P�ʁj,�@�l�ԍ�,���L�ғ�,�������w���,���p�\�j��,�J�n����,�I������,���p�\�������L����,�摜,�摜_���C�Z���X,�T�v,�T�v_�p��,����,����_�p��,URL,���l
063631,0400000001,�R�`��,�M�`��,��t�ڗ����@��,���N�V�����R�E�j�����C,��t�ڗ����@��,,���w��L�`������,���p�H�|�i,�������ړI�W�,�M�`���x��,,38.611979,140.272256,0233-32-2246,,,,,,1962/4/1,,,,,,,,,,,,
063631,0400000002,�R�`��,�M�`��,�x���c�A�x��,�z���E�`�^�E�G�I�h��,�x���c�A�x��,,���w�薯��������,�|�\,,�M�`���x��,,38.691428,140.320186,0233-32-2246,,,,,,1962/4/1,,,,,,,,,,,,���`�������̈׍��W���M�`������ɐݒ�
063631,0400000003,�R�`��,�M�`��,�e��,�I���X�M,�e��,,���w��V�R�L�O��,���̑�,,�M�`���x�c,,38.691428,140.320186,0233-32-2246,,,,,,1975/3/1,,,,,,,,,,,,���`�������̈׍��W���M�`������ɐݒ�
063631,0400000004,�R�`��,�M�`��,�F����,�L�g�E�d�J,�F����,,���w��V�R�L�O��,���̑�,,�M�`���x�c,,38.672618,140.274678,0233-32-2246,,,,,,1975/3/1,,,,,,,,,,,,
063631,0400000005,�R�`��,�M�`��,��t�@�����Ĕ�,���N�V�j�����C�Z���}�C�o�`,��t�@�����Ĕ�,,���w��L�`������,���p�H�|�i,�������ړI�W�,�M�`���x��,,38.611979,140.272256,0233-32-2246,,,,,,1985/2/9,,,,,,,,,,,,
063631,0400000006,�R�`��,�M�`��,�я��@���Փ���,�����V���E�C���J�^�c�L�c�c�K�},�я��@���Փ���,,���w��L�`������,���p�H�|�i,�я��@,�M�`���x�c,,38.679658,140.279656,0233-32-2246,,,,,,1985/2/9,,,,,,,,,,,,
063631,0400000007,�R�`��,�M�`��,�V�R�_�Иk��,�V���U���W���W�����j�O�`,�V�R�_�Иk��,,���w��L�`������,���p�H�|�i,�V�R�_��,�M�`������,,38.704392,140.366075,0233-32-2246,,,,,,1985/2/9,,,,,,,,,,,,
063631,0400000008,�R�`��,�M�`��,����a��,�i�K�T�����V,����a��,,���w�薳�`������,�H�|�Z�p,,�M�`������,,38.691428,140.320186,0233-32-2246,,,,,,1986/3/20,,,,,,,,,,,,���`�������̈׍��W���M�`������ɐݒ�
063631,0400000009,�R�`��,�M�`��,�x���~�x��,�z���E�`�{���I�h��,�x���~�x��,,���w�薯��������,�|�\,,�M�`���x��,,38.691428,140.320186,0233-32-2246,,,,,,1987/6/20,,,,,,,,,,,,���`�������̈׍��W���M�`������ɐݒ�
063631,0400000010,�R�`��,�M�`��,���H���|,�T�o�l�_�e,���H���|,,���w��V�R�L�O��,���̑�,,�M�`���x�c,,38.677381,140.281345,0233-32-2246,,,,,,1995/4/24,,,,,,,,,,,,
063631,0400000011,�R�`��,�M�`��,�n��R�����l����,�{�N�K�T���X�C�J���W���r���E�u,�n��R�����l����,,���w��L�`������,���p�H�|�i,������,�M�`������,,38.705203,140.367284,0233-32-2246,,,,,,1998/4/25,,,,,,,,,,,,
063631,0400000012,�R�`��,�M�`��,�O���̏�,�l���u�c�m�}�c,�O���̏�,,���w��V�R�L�O��,���̑�,,�M�`������,,38.726248,140.3858,0233-32-2246,,,,,,1998/4/25,,,,,,,,,,,,
063631,0400000013,�R�`��,�M�`��,���m�O���,�j�V�m�}�G�C�Z�L,���m�O���,,���w��V�R�L�O��,���̑�,���m�O���,�M�`���M�`,,38.692177,140.312734,0233-32-2246,,,,,,2002/7/29,,,,,,,,,,,,
063631,0400000014,�R�`��,�M�`��,�啽�R�_�_�� �i�V��G,�I�I�_�C�����}�m�J�~�W���W���S�E�e���W���E�C�^�G,�啽�R�_�_�� �i�V��G,,���w��L�`������,���p�H�|�i,�啽�R�_�_��,�M�`���M�`,,38.722782,140.34659,0233-32-2246,,,,,,2003/6/23,,,,,,,,,,,,
